Nunit Test Not Found In Cache

nunit test not found in cache. 0 of cypress and integrated it in to my project. NUnit is failing in C++/CLI with a System. Fixing "The type or namespace name 'NUnit' could not be found" in 2020. I have tested the action against NUnit 3. I see the tests listed under "Not Run Tests" and they even display the value of the parameters in TestCaseSource. One option around this is to factor the logic between the caching into its own method and test that. The private _context variable does have the TestName however this is no use to me!. You have to write test scripts by yourself, but NUnit allows you to use its tools and classes to. The NUnit Test Engine API is our first published API for discovering, exploring and executing tests programmatically. Let's introduce IHttpClientHelper interface to mock httpclient. Invalid Custom Field. The remaining smart contracts are for obtaining larger amounts of test. These things are called test attributes. 05 Informational] NUnit3TestExecutor converted 48 of 48 NUnit test cases [7. I have tried everything mentioned in this post: NUnit doesn't find tests in assembly. 5) and TestDriven. 5 as well as 2. When unit testing ASP. when nunit runs the second test, the hashtable is empty again, so it try to load the context again, then the exception occurs. Select online on the left. Today, when I was uploading new version of EasyFlipView library on jCenter , then I found this strange error which was not rebuilding my whole library module. The cake commands just call out to the underlying. Make sure you copied it correctly without spaces or tabulation signs. Current behavior: I have just installed version 4. To cache downloaded dependencies and build outputs use cache action provided by the Github community. If the address isn't found, then we have a "cache miss" and the processor we'll have to perform a round-trip to the main memory in order to obtain the required data. Note: As of Visual Studio 2017 15. visual studio nunit tests not found (20) Discovery The top answers above did not work for me (restarting, updating to version 1. As a pointer, using the Flush method in the TestSetup section of NUnit is a good way to avoid this problem in the future. However, I do not recommend synchronously blocking on the task directly because that will complicate your error path testing (exceptions are wrapped in an AggregateException). As we understood in the Best practices of API Controller Unit Testing "Controller" unit testing is important to make API or MVC Controller it robust. engine' The Problem. title }} API Logs. Visual Studio Unit Testing. NET Core: MSTest, XUnit, and NUnit. 4f1 to 2019. The IDbCommand and IDbConnection implementation in the assembly System. 404 Not Found. NET function. This attribute helps scripts to instruct the InitElements method to cache the element once it's located. I installed… >>> More. org or a specified feed, and add it to the tools cache. Stuck on OCB: OcScanForBootEntries failure - Not Found OC: Failed to find SB model disable halting on critical error This is due to OpenCore being unable to find any drives with the current ScanPolicy, setting to 0. 6 support and it will be available in future releases. If there is no match a new cache entry will be created and saved with the provided key in the path directory. Featured Topics How To Product Documentation. Chocolatey integrates w/SCCM, Puppet, Chef, etc. I am new to NUnit testing and for some reason while trying to set up global variables, the program loses all references to all tests. When a web cache has a requested resource in its store, it intercepts the request and returns a copy of the stored resource instead of redownloading the resource from the originating server. Join thousands online course for free and upgrade your skills with experienced instructor through OneLIB. With the library dependency defined. For MSTest and Nunit they have there own test attributes, Only thing is you have to set the attributes in the correct way. for recent releases of. In this NUnit Tutorial you will learn how to use NUnit Testing in C# Console application using Visual One of the most popular ones in the. NET 2008 boggin View all 2 comments Acceptance Tests for User Stories allow the Product Owner to more easily say whether or not they accept a Story as ‘Done’. I'm testing some functions and they could doesn't work stably in all devices, so I decided to release betas to Enable full Universal Hide if Zygote namespace is not found in Magisk log. I am trying to create. VS2017 --> No test matches the given testcase filter `FullyQualifiedName. Locate GTest find_package(GTest REQUIRED) include_directories(${GTEST_INCLUDE_DIRS}) #. It takes time to get used to, but it is a really good tool. I'm trying to get the Codebase element to reference a dll from a directory other than the base directory, but my machine. Invalid Request Conflict Element in Request. dotnet add package Moq --version 4. To anyone that cares,Recently installed Resharper 8. NUnit package to work with Playwright, but. Asset StoreA growing library of free and commercial assets created by Unity and members of the community. Nunit test for TestSort. success of a positive test is when the code does what is expected. Not a strict unit test, but a runtime check that has helped me with some intermittently failing tests. When downloading files, you will see an event not found in the file. NUnit shows up in my project references, and there doesn't appear to be a problem. service not found" in RHEL 8 Linux was helpful. config this way configures SpecFlow to use MsTest. Moq is a mocking library for. ] This is a more comprehensive blog than the one we published in November. pb 10:51:48. Error_key_does_not_exist. Here is a snipit of the code. 05 Warning] SetUp failed for test fixture Auto. Taurus adds additional options to running your tests, like test failure criteria, and also enables connecting. Displaying Help. update: I open my chrome console and found that angular service store the data in browser Local Storage, Once i delete this storage, my unit test passed, but refresh, it comes again. Adding the unitTestProvider to the app. Disclaimer: Please note, any content posted herein is provided as a suggestion or recommendation to you for your internal use. If you are trying to import one local file inside another and passed a wrong path to the require() function you will see this error again. NET platform. 6 was released just a few days ago and is not yet supported in ReSharper 6. 7 the temporary files are no longer used. For one thing, if the data repository just ignores the cache, then my code is failing. Interfaces No tests found. To demonstrate httpclient mocking using Xunit, I am creating a simple web API application and adding a new test (XUnit) project. Pass(); } } Rebuild. In the following example, Test-Path is used to check that a file called resultsfile. There are a few things to double check when issues of this nature occur. nunit-console. After running DEBUG=cypress:* yarn run cypress open it looks like it's getting stuck on. Find the contract address of the Syrup Pool you're trying to unstake from. public static IEnumerable CountEqualsZeroAndHouseGrossIsGreaterTestCases { get { yield return new TestCaseData(report, report. Tests are not displayed in the Test Explorer window when using SpecFlow+ Runner¶ Note: As of Visual Studio 2017 15. 0 Home Documentation (Quality) Recipes API Reference Reference Changelog Discussions Page Not Found Search {{ state. NUnit testing in Azure function v3 (Isolated) - net5. json is a JSON configuration file of a nodejs project which contains metadata of an application + dependencies etc. API errors reference. TestDirectory as mentioned by Charlie Poole from NUnit here: The need to access files in the same directory as the test assembly is the most frequently cited reason for disabling the shadow copy. I am using C# with NUnit. " Yes, I built the project, yes the binaries exist in "Debug" and "Release" folder and yes I can execute them directly. I downloaded the NUnit 2. any(): 5016 if errors != "ignore": -> 5017 raise KeyError(f"{labels[mask]} not found in axis") 5018 indexer. Maybe it was not installed or something like that. Download NUnit Test Results Viewer for free. Tuesday, February 20, 2018 5:52 PM. If you do not have this, SpecFlow uses NUnit as default. Install-Package Moq -Version 4. UWP TestContainer was not found. This is generally good practice for libraries because your users don't typically need your test dependencies to use your library. Link runTests with what we want to test and the GTest and pthread library add_executable(runTests tests. The minimum system requirements for Miniconda and Anaconda installers can be found in the conda user guide. GetReloadToken ()'. The /cleanup option erases the shadow copy cache and exits. Live Unit Testing is present in the Enterprise edition of Visual Studio 2017 and it’s available for C# and VB projects that target the. Use this DLL with your NUnit test manager of choice (nunit-console, gnunit, etc. 0` assembly in place of `net45` - Csharp nunit It seems that assertion of exception message doesn't work - Csharp. The items of the Application level cache are stored for the entire period of existence of the application and can be deleted only by clearing the. Last year, we introduced the option to make PackageReference the default package management format for managing NuGet dependencies when installing the first NuGet package for a newly created projects. When I run test that is in test fixture that inherits from class containing [SetUp] AND/OR [TearDown] AND/OR [TestFixture] attribute and is located in different assembly, then test is NOT discovered. log file in /cache. NET world is NUnit. For what it's worth, we do use NUnit 3 (latest) and FakeItEasy. NET tools, so 'dotnet test' and 'dotnet xunit' and in the past using the xunit commands/tools has given more specific options - we were looking at this to change the output format. The caching code is implemented in a regular C# class library, and I have NUnit 2. Nunit Test Framework! Convert the format to the format you want completely free and fast. Copy NUnitSquishCoco. Just something for you to consider. Other installation methods can be found here. The Visual Studio Test Adapter cache may also get corrupted, causing tests to not be displayed. Any hint in the right direction would be helpful. I googleit and try to find any option is available but i am not getting the positive result. paket add Moq --version 4. com (The path that is shown in the error) Delete all of those folders in that "packages. Here how it works. Execution failed for task ':app:compileDebugJavaWithJavac'. Description After updating to the new version 16. After creating your NUnit tests, you can run them in Taurus. However, you cannot find a single place where you. He took advantage that NUnit runs TestFixtures in alphabetical order and named the fixtures in order he wants to run them. This is probably better if you want a deployment pipeline. NET Interactive. I want to try to run my test case at least three times, if it fails for first and second time. And that’s it! You dont actually need the Microsoft. But this exception does not show when I run my test in isolation (no other test running). Checks the global assembly cache. BlockMappingStartToken; Room to improve for NetBeans IDE: View codecoverage data file in IDE (Windows ENV) GUI view of those test results. SQLite is located in the application directory or in the Global Assembly Cache. Instead of 1500 Tests, it's running only 300. NUnit has a TestCaseSource feature which sometimes can be very handy when you have methods that need multiple parameters to cover all test cases. Probes for the assembly using the following steps: If configuration and publisher policy do not affect the original reference and if the bind request was created using the Assembly. The only installed nuget packages are MSTest. Let's take a look at a simple example of unit testing in which we. Types of caches. deprecated test runner for. The processor architecture settings are correct. service: Unit network. Read this blog post to learn the most popular annotations that will help you test your code. If the assembly is in the GAC, use. Testing an ASP. Browser Extension View issues and test coverage without leaving GitHub v1. , there is no dependency between the tests. I do not have the VS extension adapter installed, running everything from nuget packages. Please reinstall libmcrypt. I have placed a breakpoint in the GetUserByUserName method and noticed that its. We'll also be shipping project template downloads for NUnit, MBUnit and other unit test frameworks as well, so if you prefer to use those instead you'll also have an easy one click way to create your application and have a test project immediately ready to use with it. MissingMethodException : Method not found: 'Microsoft. In NPM based applications such as nodejs, Angular, VueJS, and ReactJS applications, the package. The test implicitly tests the CPU, L1 and L2 caches as well as the motherboard. Think of it as the @Test keyword in JUnit and [TestCase] in NUnit. The API for test adapters for. 0: Test execution complete. However, if the 1362 unit test methods are not showed in the Test Explorer, please try to check your unit test code if there have some invalid unit test methods. 0 is released under the MIT license. So if you have been around a while you will have undoubtedly come across the need to perform some sort of remote procedure call. The error was. Click Download. I created some new tests for a specific library, however when I tried to load and run my tests, nothing happened. universal-safetynet-fix. 0, and XUnit. Module Not Found. net core, use the nunit 3 visual studio adapter. 1 installer for windows and installed it under an admin account to WinXP. Today I discovered an annoying bug in the NUnit Test Adapter, a Visual Studio extension that integrates NUnit test execution in the IDE. Merchants[4268435971532164. Metasploit is a very important and popular hacking tool for cyber security experts. CMake generates native makefiles and workspaces that can be used in the compiler environment of your choice. That version is the one I was using first until I found a comment online that I should use the other one. The following block will run the test command via the dotnet CLI: test : stage : test script : - dotnet test The release step will be more complex than the previous because we will be using the dotnet publish command along with capturing the generated artifacts. Wasting valuable CPU cycles on the way. And then a list of errors in all files that reference NUnit, so the whole test framework. This is only the beginning, however. Users who installed Miniconda2 or Anaconda will find a similar file with the appropriate name. Still I get the same error message: "Launch failed. Plz tell is it possible to do this? MSDN Admin: I do not get I gothrough the code and now i found how they sort the test cases are getting order. To test an MVC Controller we need to add MVC to our Test project. github/workflows/ directory: name: Test. dll, and found DependOnAttribute. As of RC3 we no longer use the download cache, we use a as a test method. core and nunit. PageFactory also provide CacheLookup attribute to cache the WebElements. Archived Forums. 546 on 2013-12-12T10:30:52Plugins:. Must-share information (formatted with Markdown ): which versions are you using (SonarQube, Scanner, Plugin, and any relevant extension) Azure SonarQubePrepare/Plugin 4. exe problem with Mono. After the GVM-Check-Setup checks, it is observed when creating a scan task, "Failed to Find Config 'DABA56C8-73EC-11DF-A475-002264764CEA'" is prompted. You need an Test Adapter for that. When a mutex is granted I keep a track of which thread has it. This test will be discovered in Test Explorer but trying to run this will result in above output. Fatal error: Class 'CCache' not found. So I think just change the hashtable to static is ok. NUnit is a popular open source unit testing framework for. Barebones sample. It is a widely used tool for unit testing and is preferred by many developers today. Among other goals, I want my tests to make sure that the cache is being used when appropriate. This example workflow file must be added to your repository's. This version places tests in a separate project / folder. Thanks, Kumar. If you are using the NUnit 2 Test Adapter and are unable to migrate to the NUnit 3 test adapter, you can turn off this new discovery behavior in Visual Studio version 15. The matching credential for your request was not found. Net talking to each other, you will have to accomplish the following: Configure Selenium RC to run as a service; Edit your CruiseControl. netcoreappXX) will ultimately fail, because at the time of running, there won't be such test-case. json format to the csproj format. The following only applies to earlier versions of Visual Studio. Where to write a test? Since we may be interested in testing not just the public methods but the internal methods as well, the test should be within the same project in. You can find it in your wallet's transaction log. However, when i copy the same project to a machine with Windows 7 the test discovery fails, no tests are found in the Test Explorer Window. 0 nunit3 inline runsettings args fail to parse on Mac 2021-12-10 15:11 Avinash Kalol imported from Stackoverflow. Once installed, as soon as NUnit's test driver is executing a C# or C++ managed unit test test. Its not my purpose here to assert that you should or should not use that approach. Testing Nunit. REST Web Api unit test endpoint validity with NUnit and Moq. NET Framework. Test methods targeting. with NUnit the test method will look like: [Test] public void SearchForWatiNOnGoogle(). To automate your testing with PowerShell and Pester, you can add a workflow that runs every time a change is pushed to your repository. Been trying to figure this out for a while now, but nothing seems to fix it and I'm not sure what is causing it. Tried upgrading the test framework package, no change. Imagine how good you feel not having to go through it. 0 (build 29455). Net (latest version). Any errors found during testing are corrected in the development environment (stage 1). The first ten smart contracts enable a tester willing to obtain a small amount of test Grams to obtain some without spending too much computing power (typically, several minutes of work of a home computer should suffice). I will recommend you to remove the existing installation and follow these steps to. Using NUnit with Visual Studio. I have tried this on several combinations of Visual Studio and OS on different computers. If you try to use an MSTest assert in your tests and your test fails, NUnit will not recognize the exception. 7 Preview 3, we have introduced the capability to migrate existing projects that use the packages. In this article. Either my test gets the right answer or it doesn't and I shouldn't care if the private cache was involved. But seemingly no way to run them. You can use NUnit to run your Unit tests. for use with project. Please contact its maintainers for support. Clearing the ShadowCopy Cache. Can you confirm that the tests are not found when you run the tests with the NUnit Console?. To help to solve his problem I reflected o n MbUnit. Пишет при установке арча no caching mode page found Assuming drive cache:write through. When using the Spira Add-In for NUnit that allows you to have NUnit tests report back automatically against test cases in Spira you may run into an issue where the results do not report back and no errors or warnings are displayed. 0, SpecRun 1. Unit Test and Mock HTTPContext in ASP. I have few test cases for Web Site UI Automation. paket add RSpec-Let --version 1. Imagine our surprise. Collections. json file location is the application root. Using MOQ in unit-testing for a shipping. import pandas as pd df = pd. To find out what's new, have a look at our 2022. Ensure that the assembly System. · I can show you how it works on. 12 one of the packages dies with a very specific message: System. For backwards comp atibility with previous versions of Nunit a test method will also be found if the first 4 letters are "test" regardless of case. If privateCopy is false and the engine is not found in the first two steps, we check standard locations where the engine may have been installed. We are often asked about the reliability of errors reported by MemTest86. NET (in Java, within the same. you can either use NUnit for Test and WatiN for UI test or just for UI test you can also just use WatiN. I right-click the test-method and the test output shows: Discover test started - Discover test finished: 0 found (0:00:00,0260026)". Disclaimer: I am not a practitioner of Test Driven Development. I have worked with several of these frameworks in both small and enterprise level applications, and I have found that (in my opinion at least) NUnit and Moq are great for helping to get simple tests written quickly and to a decent standard. MissingMethodException Method not found: 'NUnit. NET MVC Controller using NUnit | DotNetCurry Unit Testing Controllers in ASP. Forums » System Workbench for STM32 » Error: Program "make" not found in PATH. IConfiguration. cpp) target_link_libraries(runTests ${GTEST_LIBRARIES} pthread). If this happens, try clearing your cache as follows: 1. Blockquote An unhandled exception has been thrown: OC\HintException: [0]: Memcache \OC\Memcache\APCu not available for local cache (Is the matching PHP module installed and enabled?). Account authorization key not found in the system. Should,Mocking Before diving into mocking with JustMock, it's Test are created within a Test Fixture by writing methods (with the appropriate attributes) that exercise your code (also referred to as the System. nunit Dispose is not called on test fixtures with LifeCycle. We are working on NUnit 2. Ensure the targeted. 8 in Tools > Options > Test. Input the command to run the tests. All mutex requests have a thirty-second timeout, after which they scream deadlock. Understanding the Folder Structure of a Project. This is supported by the Test Explorer Window by default. FileNotFoundException. This post was edited and submitted for review 4 mins ago. The problem was that I did not bother about nunit. In the vast majority of cases errors reported by the test are valid. IChangeToken Microsoft. Review Selenium’s Web Application Testing System and setup your first example test; To successfully get Selenium, NUnit and CruiseControl. Disclaimer. Caching is a technique that stores a copy of a given resource and serves it back when requested. 1 Full EditionBuild 8. You probably have a test leak, and your Jenkins job. I think it's because I am trying to create a global variable the wrong way. sonarqube\out\NUnit_Application_2118\output-cs\symrefs. By mkyong | Last updated: May 11, 2020. NUnit is an evolving, open source framework designed for writing and running tests in Microsoft. The target Nunit test file was not found or the test file could not load one of its dependencies. To learn about TestComplete support for third-party unit testing frameworks, see —. - Microsoft. Copy this into the interactive tool or source code of the script to reference the package. Start NUnit. If I try and test this method in NUnit, I’ll run into a NullReferenceException when attempting to access the static Current property of HttpContext. In the NUnit Test editor, you configure the tests to be run. So now, NUnit does its AppDomain creation thing and pow! Cached value already exists. Error "CS5001: Program does not contain a static 'Main Fixing the error "Program has more than one entry point I have a problem using docker and couldn't find a suitable solution. 1 because it was released earlier. In case you are facing the issue "npm command not found" in mac operating system. - Reimporting all assets (right click in project folder -> Reimport all). NUnit Logging tools Logging in Creatio. To find out more about the cookies, see our privacy notice. 10348 and trying to extract the current test name in the TearDown event so I can assign a screengrab filename the test name however it is always null (see the attached image). Symptoms I am trying to access a namespace, but receive the following error: error CS0246: The type or namespace name `_____'. Let's see it in action, I am using Visual Studio 2019,. Docker - exec: "bash": executable file not found in $PATH. I thought it was my VS getting buggy on me, so I restarted VS. When no tests failed in the last run, or when no cached lastfailed data was found, pytest can be configured either to run all of the tests or no tests, using the --last-failed-no-failures option, which takes one of the following values. 05 Warning] SetUpAttribute attribute not allowed in a SetUpFixture [7. NET Core Controller. This information intended to be helpful for developers working with the mojoPortal Source Code in Visual Studio 2008. InstancePerTestCase without TearDown method - Csharp nunit Assert. NUnit does support async Task unit tests; unfortunately, Xamarin is using an older version of NUnit that does not. In Webdock you can simply run the "Test Certbot renewal" script on your server on the Server Scripts page. Multiple-assembly projects must be loaded by specifying the name of a Visual Studio solution file or an NUnit test project. Linq; using System. If you notice that Test Explorer window misses some tests, the first thing you need to check is the output Figure 1: Output for test adapters can be found in standard Output Window. For NUnit the Test Explorer Window has no support. The unit tests that does not involve NHibernate and SQLite are still running fine. Otherwise, add the key-value pair to the cache. I have a new Linux laptop and I wanted to run C# code. In other words, any attribute marked [ CacheLookup] will not be searched over and over again - this is especially useful for elements that are always going to be. Решение: # yum install pspell-devel. Either install docker for mac or docker for windows. However, this is false. NET programming languages. If you try to use an MSTest assert in your tests and your test fails, NUnit will not recognize the exception. InvalidPolicyConfig: Module for policy 'KerasPolicy' could not be loaded. log is present. py in drop(self, labels, errors) 5015 if mask. org (Updated January 2022). 0 or higher may be marked as async and NUnit will wait for the method to complete before recording the result and moving on to the next test. BlockMappingStartToken org. Once installed, as soon as NUnit’s test driver is executing a C# or C++ managed unit test test. I have also selected Windows PE as binary parser. To fix Cannot find module errors, install the modules properly by running a npm install command in the appropriate directory as your project's Can't find modules in local files. With Visual Studio Version 15. For example: A_Fixture B_Fixture … N_Fixture. Because NUnit test fixtures do not inherit from a framework class, the developer is free to use inheritance in other ways. If you are not going to add files to this directory over time and have a set of file names to enter as input to the general test, try using the RowTest NUnit extension (part of the message std distribution v2. 0 (default setting), whereas NUnit+Adapter instead target. Follow step by step solutions in this post and npm issue will vanish, i bet. What I’m talking about here is that when you run a test suite with pytest from your terminal, what that will do is to look for the methods that start with “test_”. After trying several fixes as well as reverting the version to earlier versions where I'm met with different issues. See full list on docs. Chocolatey is software management automation for Windows that wraps installers, executables, zips, and scripts into compiled packages. I noticed they run fine with the console runner (dotnet test). We couldn't find any Pancake Collectibles in your wallet. I can't Block sites from setting any data because i need allow store data in first access. but since spring. If you are getting "npm command not found" error on any OS. Install RootBeer Sample from Google Play, HIDE IT from Magisk Hide. Common Certbot Errors & Solutions. I'm using using WSL Ubuntu and have install the suggested packages in the documentation. Everything works fine on my desktop that also was reinstalled not to long ago. Exception: Could not load file or assembly 'nunit. kdestroy: No credentials cache file found while destroying cache. In order to configure Enterprise Library at runtime I'm using Enterprise Library's FileConfigurationSource to point to a […]. configure: error: no acceptable C code command is not found in mac. I know that because I 3 I inherited an assembly with MSTest, but these tests were run using nunit-console on the build. But thanks to the community members, WatiN(pronounce Waat-in) is one of the best web application testing framework I have found. Of course, when I change your code so that SimulateHttpRequest calls another base constructor, my tests run fine, but yours not. The NuGet Team does not provide support for this client. Learn how to effectively write unit tests with NUnit and Moq. 4 tests to test it. Just a quick reminder on how to set up TestCaseSource with NUnit. Please let me know, if we have any option to use in NUnit. NET Web API 2 All Unit test frameworks, offer a. However, what made this error all The error describes a module not being found. Metasploit is a framework used to create, test, and exploit exploitation. What is a module anyway? First, let's review what modules, code bundling and splitting are all about. Your tests are more readable because an attribute can describe more about the test than some code in a setup method NUnit 2. Couldn’t find the requested resource or URL, or it doesn’t exist. The installer task satisfies the 'vstest' demand and a subsequent Visual Studio Test task in a build or release pipeline can run without needing a full Visual Studio install on the agent machine. For XUnit tests, use the 'DotNetCoreTest' Cake command, rather than 'XUnit' or 'XUnit2'. Please check your libxml2 installation. exe can be found. I am using nunit 2. In order to run tests you should do the following: To add a build step to your job 'Execute Windows batch command'. exe and verify that the addin "NUnit Squish Coco" is loaded. - No 'git' executable was found - git-lfs: command not found - Repository not found - Could not read Username: terminal prompts disabled - Can't update Git version. Use HttpStatusCode enum to assert the actual result type. Could not find tools. NUnit is a unit testing framework for performing unit testing based on the. The forms interface does not currently provide for specifying more than one assembly on the command line. 1 beta is now available for testing. config runtime element seems to be ignored. CurrentContext. ----> NHibernate. In Kali Linux2020. There are thousands of exploits found in its database. In fact, several of the unit tests for RSS Bandit use this technique in order to test RSS auto-discovery. The functions get and put must each run in O(1) average time complexity. Nunit is the most popular unit testin, NUnit is open source software and NUnit 3. LoadFrom method, the runtime checks for location hints. 0-alpha1 (same result for both versions),. void put(int key, int value) Update the value of the key if the key exists. CMake is used to control the software compilation process using simple platform and compiler independent configuration files. 0: Test execution complete. we cannot run the nunit tests anymore. All you need is these 3 steps: Create a new NUnit Test Project (. 1 RC1, we have to use another way temporarily. NUnit does not create any test scripts by itself. If the assembly is found there, the runtime uses this assembly. When the NUnit Test Adapter item appears click the “Download” button. I installed NUnit via NuGet. This allows you to create a unit test target like this (Most examples don't show the need to specify a ToolPath, but I have found I need it, perhaps because it isn't in my Path?). I'm guessing that the section element type of IgnoreSection is the problem, but what do I replace it with so the runtime element · Simply comment it. Net config file to include a NUnit task. And so, under this user account, I wanted to design a new test assembly and tried to assign the NUnit-assembly-reference to it. Really bad is that the vstest reports succeeded even if the tests do not run. I am doing this to avoid false alarm. The adapters have been updated, but the way you set up and run tests in Visual Studio or on the command line with dotnet test requires different references in your. Here you can see HttpClient property as well, which is. For projects that support PackageReference, copy this XML node into the project file to reference the package. Let Unity recompile the project. XMLWordPrintableJSON. It shows the same strange behavior both in NUnit runner (2. Your unit tests will only end up running under one of the test adapters, MSTest or NUnit. Find NUnit 3 Test Adaptor. UPDATE: I have recently posted a newer and better version of this code on my blog. 151 INFO: Importing Roslyn report 10:51:48. What tools/technologies do I need to use in Bamboo to trigger a Deployment, get a response from AWS that deployment is successful, then trigger a Task to run my. I built a testing framework using C#/Selenium/NUnit(Page Object Model) I have a separate testing solution with it's own Bitbucket repo. In this bug to NUnit, lorenh provides the solution about how to delete your cache. As I've stated before, I'm a big fan of completely self-contained unit tests. I have tried my own freshly-created project, the C++/CLI sample included with NUnit and the one from CodeProject How to use NUnit to test native C++ code using Visual Studio 2008sp1 with NUnit 2. #r directive can be used in F# Interactive, C# scripting and. TestFramework. And that exactly what he wanted. dll, it generates automatically a code coverage. if the function // can do the job without calling the other thing in the future, this test will break, // even though the function works properly. Hang with me here, but it seems when referencing NUnit. Technorati Tags: TDD,Test Driven Development,JustMock,JustCode,NUnit,NUnit. That overloads fails after upgrading to c# 10 - Csharp nunit Is not possible to use `netstandard2. Close down Visual Studio. net is still in 1. But, now when I run nunit-console, the present working directory will be the location where the build file is present and thus nunit-console cannot find the nunit. I encourage you to read through the documentation found in the "/clients/cs/docs" directory of the client library. NUnit is free to use. In fact since the test projects were using NUnit and not MsTest, we also could have replaced the Test projects with regular class library projects and get rid of the reference to the dll… My next build on the build server still fails, but the “MsBuilding” of the project already works. It can save a few lines of code when you want to test the same method. This made the existing dotnet-test-* adapters like dotnet-test-nunit obsolete. that my thing called another thing. If you are going to add files to this directory, I would write one. What this script essentially does is runs the following command on. Nunit - doesn't discover tests [no error-message], My tests are public and have all the correct tags. Fix package. 05 Informational] NUnit Adapter 3. 17f1 Hello everyone, I just did a totally fresh install of Unity (and Unity Hub) on a totally new PC, but for every new project I try to create in 2020. in general, // i have found this kind of testing to be less valuable and brittle. That means that each time NUnit executes discovery, new test-case will be created with id not matching to test-cases previously produced by the same method. Note: The progress bar will turn yellow if a test is not run. Text; using NUnit. I last wrote C# for money in 2004. SQLite could not be found. config format to use PackageReference instead. The controller is a class like any other class which has members like methods and. When my unit tests are compiled as x64, the Test Explorer is able to list and run each test. NUnit presents the test results in a readable format and allows a tester to debug the automated tests. Check out this post announcing. If the number of keys exceeds the capacity from this operation, evict the least recently used key. I also suggest that you start the process monitor using sysinternals. NUnit test items in TestComplete can only run assembly files (. h not found. Key parameter is used to search for a cache. CMake is a cross-platform, open-source build system. dll) that contain tests to run. 0) Install the following packages: - Microsoft. It's quick & dirty, but it worked. read_csv('my not found in axis" How can I solve this error? base. TestAdapter and MSTest. SonarQube Community Edition Version 8. ParserException: ParserException while scanning a block mapping we had this expected , but found org. An exception occurred. expected , but found org. Here is an abstract about the article. If you want to run NUnit tests with MSBuild, then you need to download and install the MSBuild Community tasks. just found the problem, I was missing an extension, you need to install "NUnit 3 Test Adapter", by going to tools>>Extensions and Updates >> Online >> Search for : "NUnit 3 Test Adapter". So, let me know your suggestions and feedback using the comment section. In other words, this problem can occur in any setting where the "sh" shell is used instead of the "bash", causing "/bin/sh: 1: MY_COMMAND: not found". 2160 and could not compile solution! I was originally using:JetBrains ReSharper 8. Details: Finding-extra-error-information-when-using-NUnit-Tests. And because there is no arbitrary convention for naming tests, the choice of names can be entirely oriented toward communicating the purpose of the test. Initializer [7. Binary not found. But I took some time last night to create an article about gRPC. Configuration. Create your first test class, any make sure it inherits the base class PageTest. In my case, because it was an NUnit test, I decided to hold a weak reference to the field in the [TearDown] method and just wait for it to be garbage collected. Your request requires credentials that are unavailable in the credentials cache. #r "nuget: RSpec-Let, 1. Conclusion. Meanwhile please try the workaround. Not too long ago, one of the most popular guidelines in designing cache-aware data structures was to split them into "hot" and "cold" parts. - Go to C:/Users/username/AppData/Local/Unity/cache/packages/packages. Your use of the packages on this site means you understand they are not supported or guaranteed in any way. With any edition of Chocolatey (including the free open source edition), you can host your own packages and cache or internalize existing community packages. Let assume that we created. exe and verify that the addin “NUnit Squish Coco” is loaded. mo (kristian mo) January 17, 2020, 1:48pm #1. I think forcing a GC somehow makes sure that all cores read the correct value for a field; because it would be very bad for the runtime if a core read a GCed value after a full GC. 151 WARN: Protobuf file not found: D:\NUnit_Application\. Now i set the flag as Zero now NUnit UI Runner show the test cases. The asserts for each test framework throw different exceptions on assert failures and each test runner expects its own exceptions to be thrown. To add a post build action 'Publish NUnit test result report' where you specify the path to the result XML from the command line. A module not found error can occur for many different reasons: The module you're trying to import is not installed in your dependencies. Create test inside Unit Test project: [TestFixture] public class UnitTest1 { [Test] public void TestMethod1() { Assert. CMake is part of a family of tools designed to build, test and package software. Binary not found. But alas, upon debugging the same test method, I was not able to view any information about local variables during debugging a unit test. And that's it! You dont actually need the Microsoft. NET pages, base classes, controls and such, I use the technique outlined by Scott Hanselman in this post. dll to the addins folder located in the bin folder where NUnit. I had no idea where to start. Why This Error Occurred. NET Standard 2. Lastly I hope the steps from the article to fix "Failed to restart network. com" folder. NET framework software that simplifies the process of creating, organising and executing automated unit Before using NUnit, let's consider the manner in which we might have constructed tests before unit testing frameworks were available. 217 INFO: Sensor C# (wrapped) (done) | time. NB If your source is currently in your root Tools | Extensions and Updates. [UPDATE 5/23/2017 : We now also support. When the testing is. 1, and found the tests are being loaded into the database correctly. The success of negative and exception test may be if the code fails as expected. HibernateException : The IDbCommand and IDbConnection implementation in the assembly System. 17f1 gives me about 450 errors. Or you could try to copy your unit test solution on other machine you install same version of VS2015 and then run these unit tests by selecting Run All option check this issue again. Wrap Up NUnit is a very flexible testing framework. NUnit Testing C# Example, C# Unit Tutorial, nunit testing in c# for beginners, nunit testing c# tutorial, nunit testing framework c#, c# nunit automated testing, integration testing c# nunit, unit testing c# nunit tutorial, nunit testing. It's probably best to match the case sensitivity of the file and the test anyway, so go ahead and fix that capitalization. It’s a way for your system to identify what’s a test case and what’s not. NET, it uses Linq expression trees and lambda expressions, you can setup methods, properties, this is often used to mock out methods the called from. Usage can use TestContext. March 16, 2010 Agile, C#, Tools, Visual Studio Acceptance Test, Agile, BDD, C#, Cucumber, NUnit, SpecFlow, TDD, unit test, User Story, VS. Its been a while since I’ve posted here and also written an article. sudo add-apt-repository ppa:ubuntu-toolchain-r/test sudo apt-get update sudo apt-get install gcc-4. NET Core Framework. 1 nuget package in Unit Test Project. com now and get ready to study online. NET framework of your project is compatible with NUnit and the NUnit Test Adapter. it's already been some me that I had to develop my application with the symfony 5 framework, I finished everything and here I am deploying my application on a shared server to test (** Infomaniak **) and boom this is the problem I come across on the way, when my application is in dev. NUnit does not copy any assemblies: the shadow copy is a. it's already been some me that I had to develop my application with the symfony 5 framework, I finished everything and here I am deploying my application on a shared server to test (** Infomaniak **) and boom this is the problem I come across on the way, when my application is in dev. Path parameter defines the file path on the runner to cache or restore. Note that the dotnet command line swallows blank lines and does not work with color. просмотров: 112993 октября 2013 года. I created a test class, just to make sure it loaded correctly: using System; using System. Install NUnit 3. Note: the NUnit3TestAdapter is also required to run the tests in Visual Studio. 4 has a set of extension points that allow you to hook into the framework at various This means you can redefine much of the way that NUnit finds, and executes the tests. Test Cases Deployments Deployments Environments Releases Monitor Monitor Incidents Packages & Registries Packages & Registries Container Registry Analytics Analytics Value stream CI/CD Code review Insights Issue Repository Wiki Wiki Snippets Snippets Activity Graph Create a new issue Jobs Commits Issue Boards Collapse sidebar Close sidebar. Make sure settings for browsers allows Javascript and. Conflicting elements found in the request. An attempt to execute such test-case using 'vstest' (which is how we run tests that target. Test Certbot Renewal script hangs for a long time, prompts for a new webroot in output. Once the download is complete follow the instructions to install the NUnit Test Adapter At the bottom of the window you may be asked to click “Restart Now” to allow the newly installed components to take effect within Visual Studio 2012. They cannot run NUnit test projects (. in general, // i have found this kind of testing to be less valuable and brittle. Symptom: Tests pass locally when run in a certain order, but fail in Jenkins when run in a different order (or tests pass/fail when run individually) Potential fixes. The results are identical. It took me over an hour of hunting to figure out how to run a single test, so I decided to write a tutorial that could help someone else go from zero to NUnit with Visual Studio Code. Chocolatey is trusted by businesses to manage software deployments. 13) configure: error: mcrypt. Metasploit is often used to detect risks in the system by conducting doing penetration tests. It worked for me. When my unit tests are compiled as x86 (because I need access to an x86 DLL), the Test. My project does not use xUnit or NUnit. Search for NUnit. You can see each test case - a combination of input separately in a graphical interface, grouped under one node. by sachabarber. To test this, I created an image of a step before the error step, and checked the command inside the container: and it worked. To find out, check all of the above. Now you should be able to compile the libraries and run the sample code. There are three different test frameworks for Unit Testing supported by ASP. 18 I was already updated, deleting the temp files, clearning NuGet cache etc). In this article, we shall see the Unit Test and Mock the HttpRequest in ASP. Except I do care. The NUnit test runner's output is in color, but you won't see it. visualstudio. 1's Caching block to cache data retrieved from web services. 1 beta blog post. NUnit package to work with Playwright, but. This will clear the "index cache" and force conda to sync metadata from the repo server. It is impossible for the test to determine what causes the failure to occur. Управление сайтом (Гостевой форум). These things are available to to solve the issues like yours and to minimize the automation run time. We've seen several ways to get parameters into our test, and we haven't even seen all of the options This will save us lots of heartache and will keep us from building things ourselves. An exception occurred while test discoverer 'NUnit3TestDiscoverer' was loading tests. After docker is installed, run it if it is not running and make sure the docker logo is stable. Once Act is installed, make sure you have Docker installed. This is good way to test the application code before it goes for quality assurance (QA). 9 InvalidArgumentException Please provide a valid cache path. Usually I do all my work under a normal user account, having no admin rights. As Philip mentioned you have to also install Nunit Adapter in Tools >> Extensions and Updates and search online for Nunit test adapter and download it, then restart the Visual studio and it should discover all your test and now you can run it too. Hi Guys, I have one DataFrame in pandas as given below. When i try to run the test class i get the following error :Object reference not set to an instance of an object. Sonar properties are not used by Azure Devops. org (Updated January 2022). All Unit test frameworks, offer a. 0 Preview 1 to learn about it. Test is the configuration and means that ScalaCheck will only be on the test classpath and it isn't needed by the main sources. 0f1, 445 errors NUnit type or namespace not found, anyone can help me?. 1) Configure: error: xml2-config not found. NET Framework 4. This error seems straightforward: the filesystem module is not found. In my current project I'm using Enterprise Library 3. The Unit test is a block of code that helps us in verifying the expected behavior of the other code in isolation; i. Nunit Test Class: [TestFixture] public class UserTest {. Fresh from a VSS new install (haven't used VSS in literally years), I failed to spot the build warning that my test project was targeting. NET Core changed with the release of Visual Studio 2017 and the move from the project. After updating unity 2019. [Test] public void CanGetUserByUserName() {. If you have one NUnit test project per Microsoft Visual Studio solution, to test all the projects (assemblies) in the solution, running NCover on the NUnit test assembly, all NUnit tests will be run and the coverage of all assemblies will be reported, when you are just interested in a specific assembly, you can let NCover run only specific NUnit tests. Enroll Azure Devops Visual Studio Test Nunit on developercommunity. sonarqube\out\NUnit_Application_2118\output-cs\token-cpd. Think wisely when you use TestInitialise and TestCleanup. framework assemblies when using the nunit-gui because they were in the same folder as that of nunit-gui. Framework; namespace MyNamespace { [ TestFixture ] public class UnitTests. Upgrading is not a possiblity. The solution has tests written both in Nunit and in MSpec, and everything is good except for that specific assembly. Azure DevOps Services | TFS 2018 Update 2. dll, it generates automatically a code coverage. It's always great to find that particular feature that is just what we. Use this task to acquire the Microsoft test platform from nuget. Here's some code from my project that I simply can't get to even execute. Generic; using System. 4, a GVM is installed. 'NUnit Test Results Viewer' is a free open source project that allows to view NUnit resulted *xml file. We're investigating the logic behind this issue. Test Explorer not discoverying test methods. json not found an error.

zki mkh hlu fid vbl jns vdr haf hgo itb akf izn xnj qsr yrn nmo nza owv sub byi